{"text_format":"1","workbook":"xlsx","n_sheets":25,"sheets":["Liste des Onglets","TDB","DonnéesUtiles","NDC","Listes","Q","C&D","QCDR","Guide_support","R","Format_A3","RACI","Objectifs","Analyse_PP","Plan_DOC","Plan_Comm","BilanTemps","SADT_Modèle","PCO","Lexique","Plan_Collecte","Couleurs","N+1","LOG","Tables"],"not_rendered":{"charts":2,"images":3,"macros":1,"external_links":0,"defined_names":22,"comments":8,"pivot_tables":1},"unopened":[],"bounds":{"document_bytes":16777216,"sheet_cells":100000,"rows_first":2000,"rows_last":500,"rows_between":2000,"halvings":0,"cell_chars":16384,"cell_head_chars":4096},"cells_cut":0,"cells_raw":0,"read":"whole","date_system":"1900"}

{"sheet":"Liste des Onglets","index":0,"n_rows":8,"n_cols":4,"rows_kept":8,"cut":false,"hidden":false,"merged":[]}
["Etape","Nom","Lien vers la Feuille","Description"]
[null,"TDB","TDB!A1","Tableau de Bord"]
[null,"C&D","C&D'!A1","Collectes et Indicateurs C (Couts) et D (Délais)"]
[null,"R","R'!A1","Collecte et Indicateur R (Risque)"]
[null,"Q","Q!A1","Collecte et Indicateur Q (Qualité)"]
[null,"RACI","RACI!A1","RACI (Planification et Plan de Communication)"]
{"$rows_left_out":3}
{"sheet":"TDB","index":1,"n_rows":30,"n_cols":15,"rows_kept":30,"cut":false,"hidden":false,"merged":[[8,4,9,4],[3,13,3,14],[20,13,20,14],[27,13,27,14],[29,5,31,9],[1,5,3,5],[1,6,3,9],[8,5,9,6]]}
[]
[null,null,null,null,null,{"$f":"DonnéesUtiles!A16","v":"Code_Projet"},{"$f":"DonnéesUtiles!B16","v":"<titre du projet>"}]
[null,null,"Phase actuelle","Fin prévue ",null,null,null,null,null,null,null,"Date"]
[null,null,{"$f":"DonnéesUtiles!$G$9","v":"Décider"},{"$f":"VLOOKUP(C4,DonnéesUtiles!C22:E31,3,FALSE)","v":"00:00:00"},null,null,null,null,null,null,null,"2026-03-01",null,"Equipe projet"]
[null,null,null,null,null,null,null,null,null,null,null,null,null,{"$f":"DonnéesUtiles!I46","v":"Chef(s) de Projet"},{"$f":"DonnéesUtiles!J46","v":"Fonction"}]
[null,null,null,null,null,null,null,null,null,null,null,null,null,{"$f":"DonnéesUtiles!I47","v":" "},{"$f":"DonnéesUtiles!J47","v":0}]
{"$rows_left_out":25}
{"sheet":"DonnéesUtiles","index":2,"n_rows":63,"n_cols":22,"rows_kept":63,"cut":false,"hidden":true,"merged":[]}
["Données uniquement présentes dans le Pilotage de la Gouvernance (parce que pourraient évoluer indépendamment)"]
["Version :","0.82",null,"Gouvern.","Comité de Projet","Matrice"]
[null,null,null,null,"PRJ3","PS"]
[]
[]
["Données de Sortie du Fichier"]
{"$rows_left_out":58}
{"sheet":"NDC","index":3,"n_rows":51,"n_cols":20,"rows_kept":51,"cut":false,"hidden":true,"merged":[[48,13,50,13],[26,1,26,2],[27,1,27,2],[21,1,21,3],[9,1,13,2],[16,2,16,3],[17,2,17,3],[16,1,19,1],[18,2,18,3],[19,2,19,3],[15,2,15,3],[45,1,45,3],[45,4,45,12],[16,8,16,9],[17,4,17,5],[9,13,13,13],[16,13,19,13],[31,13,33,13],[48,5,48,6],[49,5,49,6],[6,1,6,12],[8,1,8,12],[14,1,14,12],[20,1,20,12],[25,6,27,12],[25,1,25,3],[19,4,19,5],[21,7,24,12],[15,10,15,11],[16,10,16,11],[19,8,19,9],[19,6,19,7],[16,4,16,5],[16,6,16,7],[48,9,48,10],[49,9,49,10],[50,9,50,10],[47,9,47,10],[50,7,50,8],[28,4,28,12],[40,1,40,2],[35,1,35,2],[29,1,29,12],[30,1,30,3],[34,1,34,12],[31,1,33,2],[36,1,36,2],[37,1,37,2],[38,1,38,2],[39,1,39,2],[35,6,35,7],[0,11,0,12],[1,11,1,12],[2,11,2,12],[15,6,15,7],[3,3,3,4],[7,4,7,12],[7,1,7,3],[3,1,3,2],[3,9,3,10],[5,9,5,11],[4,9,4,11],[4,1,4,3],[5,1,5,3],[4,5,5,8],[2,5,3,8],[3,11,3,12],[48,1,50,1],[50,3,50,4],[47,3,47,4],[48,7,48,8],[44,1,44,12],[47,1,47,2],[46,1,46,12],[47,7,47,8],[49,11,49,12],[50,11,50,12],[48,11,48,12],[47,5,47,6],[48,3,48,4],[49,3,49,4],[50,5,50,6],[49,7,49,8],[43,1,43,2],[9,4,12,7],[9,9,12,12],[15,8,15,9],[19,10,19,11],[18,6,18,7],[18,8,18,9],[17,10,17,11],[18,10,18,11],[15,4,15,5],[17,6,17,7],[18,4,18,5],[17,8,17,9],[28,1,28,3],[42,1,42,2],[41,1,41,2]]}
[null,null,null,null,null,null,null,null,null,null,null,"ENR 230 "]
[null,null,null,null,null,null,null,null,null,null,null,"Ind C 10/02/2020  "]
[null,null,null,null,null,"Projet"]
[null,"Initiateur :",null,0,null,null,null,null,null,"Chef de Projet :",null," "]
[null,"Date de Début :",null,null,"00:00:00","Code_Projet",null,null,null,"Date de Début : ",null,null,"00:00:00"]
[null,"Date de Fin :",null,null,"00:00:00",null,null,null,null,"Date de Fin  :",null,null,"00:00:00"]
{"$rows_left_out":46}
{"sheet":"Listes","index":4,"n_rows":174,"n_cols":6,"rows_kept":174,"cut":false,"hidden":true,"merged":[]}
["Unité ?","Membre ?"," PNOM ?",null,"Processus ?","Direction ?"]
["%","Pilote"," PNOM ?","Titre ?","DG (Diriger le Groupe)","Président"]
["ppm","Expert","AABDELFETTAH",null,"GRC (Gérer la Relation Client)","DDC (Direction Développement Commercial)"]
["DPMO","Chef_Adj.","AAFFANE",null,"GI (Gérer les Infrastructures)","DA (Direction Achats)"]
["k€/An",null,"AATBIR",null,"GRH (Gérer les Ressources Humaines)","DO (Direction Opérations)"]
["min/Unité",null,"ABRIODIN",null,"GRIC (Gérer les Ressources Informatiques et de Communication)","DI (Direction Ingineering)"]
{"$rows_left_out":169}
{"sheet":"Q","index":5,"n_rows":71,"n_cols":13,"rows_kept":71,"cut":false,"hidden":false,"merged":[]}
["N° d'Action","Source du déclenchement de l'action","Cause racine ou \nRisque ","Plan d'action","PNOM du Resp.","Gain Estimé","Date de Début","Date de fin prévue","Date de Fin","Justificatif d'Efficacité","N° d'action (si non efficace)","Statut Qualité",{"$f":"QCDR!F3","v":0.10003483733937224}]
[1,null,null,null,null,null,null,null,null,null,null,{"$f":"IF(I2>0,\"Close\",IF(AND(H2>0,H2<TDB!L$4),\"En Retard\",IF(AND(G2>0,G2<=TDB!L$4),\"En Cours\",IF(E2>\"\",\"Attribuée\",IF(D2>\"\",\"Définie\",IF(OR(C2>\"\",NOT(ISERROR(VLOOKUP(A2,'R'!K:K,1,FALSE)))),\"A Traiter\",\"\"))))))","v":""}]
[2,null,null,null,null,null,null,null,null,null,null,{"$f":"IF(I3>0,\"Close\",IF(AND(H3>0,H3<TDB!L$4),\"En Retard\",IF(AND(G3>0,G3<=TDB!L$4),\"En Cours\",IF(E3>\"\",\"Attribuée\",IF(D3>\"\",\"Définie\",IF(OR(C3>\"\",NOT(ISERROR(VLOOKUP(A3,'R'!K:K,1,FALSE)))),\"A Traiter\",\"\"))))))","v":""}]
[3,null,null,null,null,null,null,null,null,null,null,{"$f":"IF(I4>0,\"Close\",IF(AND(H4>0,H4<TDB!L$4),\"En Retard\",IF(AND(G4>0,G4<=TDB!L$4),\"En Cours\",IF(E4>\"\",\"Attribuée\",IF(D4>\"\",\"Définie\",IF(OR(C4>\"\",NOT(ISERROR(VLOOKUP(A4,'R'!K:K,1,FALSE)))),\"A Traiter\",\"\"))))))","v":""}]
[4,null,null,null,null,null,null,null,null,null,null,{"$f":"IF(I5>0,\"Close\",IF(AND(H5>0,H5<TDB!L$4),\"En Retard\",IF(AND(G5>0,G5<=TDB!L$4),\"En Cours\",IF(E5>\"\",\"Attribuée\",IF(D5>\"\",\"Définie\",IF(OR(C5>\"\",NOT(ISERROR(VLOOKUP(A5,'R'!K:K,1,FALSE)))),\"A Traiter\",\"\"))))))","v":""}]
[5,null,null,null,null,null,null,null,null,null,null,{"$f":"IF(I6>0,\"Close\",IF(AND(H6>0,H6<TDB!L$4),\"En Retard\",IF(AND(G6>0,G6<=TDB!L$4),\"En Cours\",IF(E6>\"\",\"Attribuée\",IF(D6>\"\",\"Définie\",IF(OR(C6>\"\",NOT(ISERROR(VLOOKUP(A6,'R'!K:K,1,FALSE)))),\"A Traiter\",\"\"))))))","v":""}]
{"$rows_left_out":66}
{"sheet":"C&D","index":6,"n_rows":140,"n_cols":18,"rows_kept":140,"cut":false,"hidden":false,"merged":[]}
["Date","Sujet","Chef","Pilote","Expert","Temps","Statut \nCoût","Nature","Phase","Autres Informations (Annulation, Retard, Dépassement...)","Statut Délai","FPX",{"$f":"QCDR!F4","v":1.1701944087076921E-3},{"$f":"QCDR!F5","v":0.89999252904770466}]
[null,null,null,null,null,null,{"$f":"SUM(C2:E2)*F2","v":0},null,null,null,{"$f":"IFERROR(VLOOKUP(I2,Tables!$F$1:$G$12,2,FALSE),\"\")","v":""},{"$f":"IF(H2=\"Fin de Phase\",I2&\"_X\",\"\")","v":""},{"$f":"DonnéesUtiles!M23","v":1},{"$f":"DonnéesUtiles!N23","v":0},{"$f":"DonnéesUtiles!O23","v":"00:00:00"},{"$f":"DonnéesUtiles!P23","v":"00:00:00"},{"$f":"DonnéesUtiles!Q23","v":0},{"$f":"DonnéesUtiles!R23","v":""}]
[null,null,null,null,null,null,0,null,null,null,{"$f":"IFERROR(VLOOKUP(I3,Tables!$F$1:$G$12,2,FALSE),\"\")","v":""},"",{"$f":"DonnéesUtiles!M24","v":2},{"$f":"DonnéesUtiles!N24","v":0},{"$f":"DonnéesUtiles!O24","v":"00:00:00"},{"$f":"DonnéesUtiles!P24","v":"00:00:00"},{"$f":"DonnéesUtiles!Q24","v":0},{"$f":"DonnéesUtiles!R24","v":""}]
[null,null,null,null,null,null,0,null,null,null,{"$f":"IFERROR(VLOOKUP(I4,Tables!$F$1:$G$12,2,FALSE),\"\")","v":""},"",{"$f":"DonnéesUtiles!M25","v":3},{"$f":"DonnéesUtiles!N25","v":0},{"$f":"DonnéesUtiles!O25","v":"00:00:00"},{"$f":"DonnéesUtiles!P25","v":"00:00:00"},{"$f":"DonnéesUtiles!Q25","v":0},{"$f":"DonnéesUtiles!R25","v":""}]
[null,null,null,null,null,null,0,null,null,null,{"$f":"IFERROR(VLOOKUP(I5,Tables!$F$1:$G$12,2,FALSE),\"\")","v":""},"",{"$f":"DonnéesUtiles!M26","v":4},{"$f":"DonnéesUtiles!N26","v":0},{"$f":"DonnéesUtiles!O26","v":"00:00:00"},{"$f":"DonnéesUtiles!P26","v":"00:00:00"},{"$f":"DonnéesUtiles!Q26","v":0},{"$f":"DonnéesUtiles!R26","v":""}]
[null,null,null,null,null,null,0,null,null,null,{"$f":"IFERROR(VLOOKUP(I6,Tables!$F$1:$G$12,2,FALSE),\"\")","v":""},"",{"$f":"DonnéesUtiles!M27","v":5},{"$f":"DonnéesUtiles!N27","v":0},{"$f":"DonnéesUtiles!O27","v":"00:00:00"},{"$f":"DonnéesUtiles!P27","v":"00:00:00"},{"$f":"DonnéesUtiles!Q27","v":0},{"$f":"DonnéesUtiles!R27","v":""}]
{"$rows_left_out":135}
{"sheet":"QCDR","index":7,"n_rows":6,"n_cols":10,"rows_kept":6,"cut":false,"hidden":true,"merged":[]}
["Nota: XLIM atteint donne une valeur objectif à ~37% => 100-37 = 73%",null,null,null,null,null,null,null,null,24]
[null,"xLIM","xNQ","xGQ","Mesure","QCDR","Cible","Limite","Dépassement"]
["Qualité",0.8,0,1,{"$f":"DonnéesUtiles!H9","v":1},{"$f":"100%-IF((IF(E3>B3,1,-1)*IF(D3>C3,1,-1))>0,EXP(-EXP(-(2.25/(D3-B3))*(E3-B3))),EXP(-EXP(-(-0.834/(C3-B3))*(E3-B3))))","v":0.10003483733937224},0.37,0.73,1.1000000000000001]
["Coût",1.2,1.5,0.8,{"$f":"DonnéesUtiles!I9","v":0},{"$f":"100%-IF((IF(E4>B4,1,-1)*IF(D4>C4,1,-1))>0,EXP(-EXP(-(2.25/(D4-B4))*(E4-B4))),EXP(-EXP(-(-0.834/(C4-B4))*(E4-B4))))","v":1.1701944087076921E-3},0.37,0.73,1.1000000000000001]
["Délai",0.8,0,1,{"$f":"DonnéesUtiles!J9","v":0},{"$f":"100%-IF((IF(E5>B5,1,-1)*IF(D5>C5,1,-1))>0,EXP(-EXP(-(2.25/(D5-B5))*(E5-B5))),EXP(-EXP(-(-0.834/(C5-B5))*(E5-B5))))","v":0.89999252904770466},0.37,0.73,1.1000000000000001]
["Risques",0.25,1,0,{"$f":"DonnéesUtiles!K9","v":0},{"$f":"100%-IF((IF(E6>B6,1,-1)*IF(D6>C6,1,-1))>0,EXP(-EXP(-(2.25/(D6-B6))*(E6-B6))),EXP(-EXP(-(-0.834/(C6-B6))*(E6-B6))))","v":0.10003483733937224},0.37,0.73,1.1000000000000001]
{"$rows_left_out":1}
{"sheet":"Guide_support","index":8,"n_rows":20,"n_cols":9,"rows_kept":20,"cut":false,"hidden":true,"merged":[[9,3,9,4],[9,5,9,6],[9,7,9,8],[10,3,10,4],[10,5,10,6],[10,7,10,8]]}
[]
[null,"Chemin gestion de projet"]
[null,"Mode op de fonctionnement ou support"]
[null,"Accès ndc"]
[null,"Gouvernance"]
[null,"Table des risques"]
{"$rows_left_out":15}
{"sheet":"R","index":9,"n_rows":81,"n_cols":20,"rows_kept":81,"cut":false,"hidden":false,"merged":[]}
["N°","Etape / Fonction / Exigence","Mode de Défaillance Potentielle","Effet(s) Potentiel(s) de la Défaillance","G","Cause(s) Potentielle(s) de la Défaillance","O","Prévention sur Cause / Inspection sur Mode ou Effets Existante(s)","D","NPR (>25)","Action N°","Info Action(s)","G'","O'","D'","NPR'","Acceptation des risques résiduels / Remarques","Traité le","Statut Risque",{"$f":"QCDR!F6","v":0.10003483733937224}]
[1,null,null,null,null,null,null,null,null,{"$f":"E2*G2*I2","v":0},null,{"$f":"IF(ISNUMBER(K2),VLOOKUP(K2,Q!A:L,12,FALSE),\" \")","v":" "},{"$f":"E2","v":0},null,null,{"$f":"M2*N2*O2","v":0},null,null,{"$f":"IFERROR(IF(OR(R2>0,AND(P2>0,P2<25,L2=\"Close\"),AND(J2>0,J2<25)),0%,IF(L2=\"Attente Décision\",100%,IF(L2=\"Attente Ressource\",75%,IF(K2>0,25%,IF(OR(J2>25,C2>\"\"),50%,\"\")))))+IF(OR(L2=\"En Retard\",AND(L2=\"Close\",OR(P2>=25,P2=0))),25%,0%),\"\")","v":""}]
[{"$f":"A2+1","v":2},null,null,null,null,null,null,null,null,{"$f":"E3*G3*I3","v":0},null,{"$f":"IF(ISNUMBER(K3),VLOOKUP(K3,Q!A:L,12,FALSE),\" \")","v":" "},0,null,null,{"$f":"M3*N3*O3","v":0},null,null,{"$f":"IFERROR(IF(OR(R3>0,AND(P3>0,P3<25,L3=\"Close\"),AND(J3>0,J3<25)),0%,IF(L3=\"Attente Décision\",100%,IF(L3=\"Attente Ressource\",75%,IF(K3>0,25%,IF(OR(J3>25,C3>\"\"),50%,\"\")))))+IF(OR(L3=\"En Retard\",AND(L3=\"Close\",OR(P3>=25,P3=0))),25%,0%),\"\")","v":""}]
[{"$f":"A3+1","v":3},null,null,null,null,null,null,null,null,0,null,{"$f":"IF(ISNUMBER(K4),VLOOKUP(K4,Q!A:L,12,FALSE),\" \")","v":" "},0,null,null,{"$f":"M4*N4*O4","v":0},null,null,{"$f":"IFERROR(IF(OR(R4>0,AND(P4>0,P4<25,L4=\"Close\"),AND(J4>0,J4<25)),0%,IF(L4=\"Attente Décision\",100%,IF(L4=\"Attente Ressource\",75%,IF(K4>0,25%,IF(OR(J4>25,C4>\"\"),50%,\"\")))))+IF(OR(L4=\"En Retard\",AND(L4=\"Close\",OR(P4>=25,P4=0))),25%,0%),\"\")","v":""}]
[4,null,null,null,null,null,null,null,null,0,null,{"$f":"IF(ISNUMBER(K5),VLOOKUP(K5,Q!A:L,12,FALSE),\" \")","v":" "},0,null,null,{"$f":"M5*N5*O5","v":0},null,null,""]
[5,null,null,null,null,null,null,null,null,0,null,{"$f":"IF(ISNUMBER(K6),VLOOKUP(K6,Q!A:L,12,FALSE),\" \")","v":" "},0,null,null,{"$f":"M6*N6*O6","v":0},null,null,""]
{"$rows_left_out":76}
{"sheet":"Format_A3","index":10,"n_rows":55,"n_cols":19,"rows_kept":55,"cut":false,"hidden":false,"merged":[[3,6,4,13],[1,10,2,13],[1,6,2,9],[7,1,8,4],[7,5,8,6],[7,11,8,14],[14,5,15,6],[39,1,51,8],[7,15,8,16],[9,1,12,8],[16,1,21,8],[25,1,35,8],[23,5,24,6],[25,11,36,18],[9,11,21,18],[23,11,24,14],[38,11,39,14],[40,11,51,18],[37,5,38,6],[38,15,39,16],[23,15,24,16],[53,1,54,2],[53,3,54,4],[37,1,38,4],[23,1,24,4],[14,1,15,4]]}
[]
[null,null,null,null,null,null,"Projet :",null,null,null,{"$f":"TDB!F2","v":"Code_Projet"}]
[]
[null,null,null,null,null,null,{"$f":"TDB!G2","v":"<titre du projet>"}]
[]
[]
{"$rows_left_out":50}
{"sheet":"RACI","index":11,"n_rows":74,"n_cols":9,"rows_kept":74,"cut":false,"hidden":false,"merged":[[69,1,69,2],[26,1,26,2],[33,1,33,2],[40,1,40,2],[48,1,48,2],[54,1,54,2],[62,1,62,2],[1,93,2,93],[1,94,2,94],[1,71,2,71],[1,72,2,72],[1,73,2,73],[1,74,2,74],[1,63,2,63],[1,64,2,64],[1,65,2,65],[1,66,2,66],[1,67,2,67],[1,68,2,68],[1,57,2,57],[1,58,2,58],[1,59,2,59],[1,60,2,60],[1,61,2,61],[1,95,2,95],[3,1,3,2],[7,1,7,2],[21,1,21,2],[1,87,2,87],[1,88,2,88],[1,89,2,89],[1,90,2,90],[1,91,2,91],[1,92,2,92],[1,81,2,81],[1,82,2,82],[1,83,2,83],[1,84,2,84],[1,85,2,85],[1,86,2,86],[1,75,2,75],[1,76,2,76],[1,77,2,77],[1,78,2,78],[1,79,2,79],[1,80,2,80],[1,69,2,69],[1,70,2,70],[1,62,2,62],[1,51,2,51],[1,52,2,52],[1,53,2,53],[1,54,2,54],[1,55,2,55],[1,56,2,56],[1,45,2,45],[1,46,2,46],[1,47,2,47],[1,48,2,48],[1,49,2,49],[1,50,2,50],[1,39,2,39],[1,40,2,40],[1,41,2,41],[1,42,2,42],[1,43,2,43],[1,44,2,44],[1,33,2,33],[1,34,2,34],[1,35,2,35],[1,36,2,36],[1,37,2,37],[1,38,2,38],[1,27,2,27],[1,28,2,28],[1,29,2,29],[1,30,2,30],[1,31,2,31],[1,32,2,32],[1,21,2,21],[1,22,2,22],[1,23,2,23],[1,24,2,24],[1,25,2,25],[1,26,2,26],[1,18,2,18],[1,19,2,19],[1,20,2,20],[1,9,2,9],[1,10,2,10],[1,11,2,11],[1,12,2,12],[1,13,2,13],[1,14,2,14],[1,3,2,3],[1,4,2,4],[1,5,2,5],[1,6,2,6],[1,7,2,7],[1,8,2,8],[1,15,2,15],[1,16,2,16],[1,17,2,17]]}
[null,"G","G","GP","G","P","P","PE","C"]
[null," ","QUI","Initiateur","Resp. Gouvernance","Chef de Projet","Directeur xxx","Président","Dir. R.H."]
[null,"QUOI"," "]
[null,"Décider"]
[null,"Identification des Parties Prenantes"]
[null,"Préparer le Pressenti (avec les PP)"]
{"$rows_left_out":69}
{"sheet":"Objectifs","index":12,"n_rows":2,"n_cols":13,"rows_kept":2,"cut":false,"hidden":false,"merged":[[0,0,0,7]]}
["<Ici les objectifs du Projet, et reprendre les verbes d'action et les décomposer>"]
["ACTION","QUOI","SUJET","CRITERE","OPTION","BENCHMARK","MESURE","COMMENTAIRES","Traité pendant","Sources","Extensions",null,"Revue du __/__/____"]

{"sheet":"Analyse_PP","index":13,"n_rows":17,"n_cols":17,"rows_kept":17,"cut":false,"hidden":false,"merged":[[5,0,5,1],[12,0,12,1],[13,0,13,1],[14,0,14,1],[6,0,6,1],[7,0,7,1],[8,0,8,1],[9,0,9,1],[10,0,10,1],[11,0,11,1],[0,0,0,1],[1,0,1,1],[2,0,2,1],[3,0,3,1],[4,0,4,1]]}
["Role (Qui)",null,"RACI",null,"Rôle","Qui","Pouvoir","Intérêt","Analyse_PI","Quoi faire ?","Synergie","Antagonisme","Type de Partie","Analyse_SA",null,"SX-AX","Analyse_SA"]
[null,null,null,null,{"$f":"IFERROR(TRIM(LEFT(A2,SEARCH(\"(\",A2)-1)),\"\")","v":""},{"$f":"IFERROR(TRIM(MID(A2,SEARCH(\"(\",A2)+1,SEARCH(\")\",A2)-SEARCH(\"(\",A2)-1)),\"\")","v":""},null,null,{"$f":"IF(G2>2,IF(H2>2,\"A Manager\",\"A Informer\"),IF(H2>2,\"A Satisfaire\",IF(H2>0,\"A Contrôler\",\"\")))","v":""},{"$f":"IF(I2=\"A Manager\",\"Efforts spécifiques à déployer pour obtenir sa participation. Elle doit être impérativement consultée, ou intégrée aux décisions liées au sujet (C idéalement)\",IF(I2=\"A Satisfaire\",\"Assurer une communication de qualité et ciblée, et essayer d'augmenter son intérêt. (R idéalement)\",IF(I2=\"A Contrôler\",\"Ne pas susciter plus son intérêt, la communication sur le sujet doit être disponible mais ne doit pas lui être adressée. (I maximum)\",IF(I2=\"A Informer\",\"Ne pas la perdre en route, donc bien la tenir informée, l'utiliser comme relais de communication et en écoute discrète des A Contrôler sur son périmètre. (I minimum)\",\"\"))))","v":""},null,null,{"$f":"IF(C2=\"I\",\"Intéressée\",IF(C2>\"\",\"Prenante\",\"\"))","v":""},{"$f":"IFERROR(VLOOKUP(\"S\"&K2&\"-A\"&L2,P:Q,2,FALSE),\"\")","v":""},null,"S1-A1","Passive"]
[null,null,null,null,"","",null,null,"","",null,null,"","",null,"S1-A2","Divergeante / Grognon"]
[null,null,null,null,"","",null,null,"","",null,null,"","",null,"S1-A3","Opposante"]
[null,null,null,null,"","",null,null,"","",null,null,"","",null,"S1-A4","Irréductible / Révoltée"]
[null,null,null,null,"","",null,null,"","",null,null,"","",null,"S2-A1","Suiveuse (entre passive et engagée)"]
{"$rows_left_out":12}
{"sheet":"Plan_DOC","index":14,"n_rows":1,"n_cols":8,"rows_kept":1,"cut":false,"hidden":false,"merged":[]}
["Quoi","%","Quand","Où","Qui","Comment","Combien","Pourquoi"]

{"sheet":"Plan_Comm","index":15,"n_rows":1,"n_cols":7,"rows_kept":1,"cut":false,"hidden":false,"merged":[]}
["Quoi ?","A qui ?","Quand ?","Responsable","Comment ?","Où ?","Pourquoi ?"]

{"sheet":"BilanTemps","index":16,"n_rows":13,"n_cols":40,"rows_kept":13,"cut":false,"hidden":false,"merged":[]}
[]
[null,null,null,null,null,null,null,null,null,null,null,null,null,null,null,null,null,null,null,null,null,null,null,null,null,null,null,null,null,null,null," ","Durée",null,"Temps",null,"Début",null,"Fin"]
[null,null,null,null,null,null,null,null,null,null,null,null,null,null,null,null,null,null,null,null,null,null,null,null,null,null,null,null,null,null,null,{"$f":"DonnéesUtiles!T22","v":"Phase"},{"$f":"DonnéesUtiles!U22","v":"Objectif"},{"$f":"DonnéesUtiles!V22","v":"Effectif"},{"$f":"AG3","v":"Objectif"},{"$f":"AH3","v":"Effectif"},"Objectif",{"$f":"AJ3","v":"Effectif"},{"$f":"AK3","v":"Objectif"},"Effectif"]
[null,null,null,null,null,null,null,null,null,null,null,null,null,null,null,null,null,null,null,null,null,null,null,null,null,null,null,null,null,null,null,{"$f":"DonnéesUtiles!T23","v":"Définir"},{"$f":"DonnéesUtiles!U23","v":0},{"$f":"DonnéesUtiles!V23","v":0},{"$f":"AG4","v":0},{"$f":"AH4","v":0},{"$f":"DonnéesUtiles!O23","v":"00:00:00"},{"$f":"DonnéesUtiles!S23","v":""},{"$f":"DonnéesUtiles!P23","v":"00:00:00"},{"$f":"DonnéesUtiles!R23","v":""}]
[null,null,null,null,null,null,null,null,null,null,null,null,null,null,null,null,null,null,null,null,null,null,null,null,null,null,null,null,null,null,null,{"$f":"DonnéesUtiles!T24","v":"Mesurer"},{"$f":"DonnéesUtiles!U24","v":0},{"$f":"DonnéesUtiles!V24","v":0},{"$f":"AG5-AG4","v":0},{"$f":"AH5-AH4","v":0},{"$f":"DonnéesUtiles!O24","v":"00:00:00"},{"$f":"DonnéesUtiles!S24","v":""},{"$f":"DonnéesUtiles!P24","v":"00:00:00"},{"$f":"DonnéesUtiles!R24","v":""}]
[null,null,null,null,null,null,null,null,null,null,null,null,null,null,null,null,null,null,null,null,null,null,null,null,null,null,null,null,null,null,null,{"$f":"DonnéesUtiles!T25","v":"Analyser"},{"$f":"DonnéesUtiles!U25","v":0},{"$f":"DonnéesUtiles!V25","v":0},{"$f":"AG6-AG5","v":0},0,{"$f":"DonnéesUtiles!O25","v":"00:00:00"},{"$f":"DonnéesUtiles!S25","v":""},{"$f":"DonnéesUtiles!P25","v":"00:00:00"},{"$f":"DonnéesUtiles!R25","v":""}]
{"$rows_left_out":8}
{"sheet":"SADT_Modèle","index":17,"n_rows":41,"n_cols":75,"rows_kept":41,"cut":false,"hidden":false,"merged":[]}
[null,null,null,null,null,null,null,null,null,null,null,null,null,null,null,null,null,null,null,null,null,null,null,null,null,null,null,null,null,null,"Décomposition Fonctionnelle du Processus :",{"$f":"I9 & \" [\" & BB38 & \"]\"","v":"<Saisir en I9 le Processus> [<et BB38 le Code>]"}]
[]
[]
[]
[]
[]
{"$rows_left_out":36}
{"sheet":"PCO","index":18,"n_rows":32,"n_cols":3,"rows_kept":32,"cut":false,"hidden":false,"merged":[[32,1,32,2],[1,1,1,2],[24,1,24,2],[2,1,2,2],[3,1,3,2],[4,1,4,2],[13,1,13,2],[14,1,14,2],[23,1,23,2],[22,1,22,2]]}
[]
[null,"Tableaux des Problématiques / Causes / Opportunités concernant les Objetifs du Projet"]
[null,"Livrable de fin de Phase Analyser et permettant de partager la vision avec les Initiateurs de manière synthétique"]
[null,"Problématique : [1] Non tenue de l'Objectif Principal"]
[null,"Mettre en place une …"]
[null,"Causes Testées et Hiérarchisées :","Opportunités d’Amélioration :"]
{"$rows_left_out":27}
{"sheet":"Lexique","index":19,"n_rows":1,"n_cols":6,"rows_kept":1,"cut":false,"hidden":false,"merged":[]}
["Terme","Domaine","Définition","Obligations","Interdictions","Projet"]

{"sheet":"Plan_Collecte","index":20,"n_rows":2,"n_cols":10,"rows_kept":2,"cut":false,"hidden":false,"merged":[[0,4,0,5],[0,6,0,7]]}
[null,"QUOI","QUI","OÙ","QUAND",null,"COMMENT",null,"COMBIEN","POURQUOI"]
["N°","Caractéristique mesurée / CTQ","Acteur de\nla mesure","Etape","Période","Fréquence","Instructions de Mesure","Capabilité","Nb de mesures","Pourquoi cette mesure est nécessaire"]

{"sheet":"Couleurs","index":21,"n_rows":139,"n_cols":6,"rows_kept":139,"cut":false,"hidden":true,"merged":[]}
["Index","Nom","Vue","R","V","B"]
[null,"black",null,"0","0","0"]
[null,"dimgray, dimgrey",null,"105","105","105"]
[6,"gray, grey",null,"128","128","128"]
[null,"darkgray, darkgrey",null,"169","169","169"]
[null,"silver",null,"192","192","192"]
{"$rows_left_out":134}
{"sheet":"N+1","index":22,"n_rows":52,"n_cols":4,"rows_kept":52,"cut":false,"hidden":true,"merged":[]}
[" PNOM ?"," N+1 !","PRJ3","PRJ2"]
["AAFFANE"]
["AATBIR","KELOUAZZANI"]
["ABRISARD"]
["AGAUDUCHON"]
["AGILBERT","CFLOURIOT"]
{"$rows_left_out":47}
{"sheet":"LOG","index":23,"n_rows":1,"n_cols":5,"rows_kept":1,"cut":false,"hidden":true,"merged":[]}
["Qui","LogIn","LogOut","Quoi","Où"]

{"sheet":"Tables","index":24,"n_rows":23,"n_cols":16,"rows_kept":23,"cut":false,"hidden":true,"merged":[]}
["Statut","Statut_TXT","=>",null,"CPE","Phase_En_Cours","CPS","ST","Q","Q_TXT","C","C_TXT","D","D_TXT","R","R_TXT"]
[-1,"Annulé","0",null,0,"Décider",0,3,"?",null,"?",null,"?",null,1,"Attente décision"]
[0,"Temporisé","0",null,1,"Définir",1,4,null,null,null,null,null,null,0.75,"Attente ressource"]
[1,"Bloqué","0-9",null,2,"Mesurer",2,4,null,null,null,null,null,null,0.5,"Problème identifié (non couvert)"]
[2,"Pressenti","0",null,3,"Analyser",3,4,null,null,null,null,null,null,0.25,"Risque identifié et action en cours"]
[3,"Initialisé","0-1",null,4,"Innover",4,4,null,null,null,null,null,null,0,"Aucun risque identifié ou risque sous contrôle"]
{"$rows_left_out":17}